InstallShield Knowledge Base

Showing results for 
Show  only  | Search instead for 
Did you mean: 

InstallShield Knowledge Base

Build Error 7141

0 1 1118
SummaryDiscusses the possible causes of Build Error 7141 during the build processSymptomsDuring a build, you receive the following build error: ISDEV : error -7141: An unexpected error occurred embedding file <path to setup.exe>CauseOften this buil...
by acurry Flexera Alumni (Retired)

InstallShield Triage and Preliminary Troubleshooting

0 6 1118
Providing the necessary information to allow a Support engineer to begin troubleshooting your issue is one of the best ways to avoid delays. This article discusses what type of information to include and how to gather it when submitting an InstallS...
by Community Manager tony_flexera Community Manager

Windows Update KB3072630 causes Registry permission changes to HKCU to fail

0 0 674
SummaryA hotfix is available: Windows update KB3072630 changed the way that custom actions in system context are allowed to interact with HKCU in order to resolve a vulnerability in Microsoft Windows:
by nbikos Pilgrim

Error 7354 When Building MSI

0 0 3860
SummaryError 7354 occurs when building the MSI projectSymptomsThe build error 7354 occurs while referencing a string that does not have the correct value in MSI projects. The issue may occur with a new project or a migrated project. The error will re...
by Flexera NameTooShort Flexera

ISDEV : fatal error -4340: Internal build error

0 0 808
SummaryThe InstallShield build process may fail presenting ISDEV : fatal error -4340: Internal build errorSymptomsThe InstallShield build process may fail in different ways. This can occur within a Visual Studio solution and outside of Visual Studio ...
by Flexera GeorgeK Flexera

The program can't start because api-ms-win-crt-stdio-l1-1-0.dll is missing from your computer

0 0 304
SummaryTrying to open AdminStudio or InstallShield results in error: The program can't start because api-ms-win-crt-stdio-l1-1-0.dll is missing from your computerSymptomsLaunch AdminStudio an error dialog occurs.CauseMissing Visual C++ 2015 Redistrib...
by Flexera GeorgeK Flexera

InstallShield Build Error: fatal error 0

0 0 810
SummaryThe InstallShield product including Express Edition build process may fail in different ways based on Trend Micro antivirus software.SymptomsThe InstallShield product including the Express Edition build process may fail with the following buil...
by Flexera Flexera_Ian Flexera

Removal of Outdated and Obsolete Items in InstallShield 2013

0 0 748
SummaryAs of InstallShield 2013, InstallShield no longer has support for a number of outdated technologies. Many of these technologies have reached their end-of-life milestone and are no longer supported by Microsoft. This article contains a list of ...
by Flexera pmillward Flexera

Installation Results in "Setup Launcher Unicode Has Stopped Working"

0 0 1419
SummaryDiscussion about the problem and cause during installation of message "Setup Launcher Unicode Has Stopped Working"SymptomsDuring installation the setup will display an ?Setup Launcher Unicode Has Stopped Working? error message as the product i...
by Flexera GeorgeK Flexera

Activation Error - Trying to Return a Fulfillment Issued to a Different Machine

0 0 565
SummaryError 0 ? Returning Fulfillment ID 12345678 was denied by the Activation Server: Trying to return a fulfillment issued to a different machineSymptomsSometimes, whilst trying to reactivate your InstallShield you may see the error:"Error 0 ? Ret...
by Flexera tmullin Flexera

Build Warning -7346

0 0 267
SummaryWhen building an InstallShield 2015 and later project that is signed with a SHA-1 certificate, ISDEV: warning -7346 occurs.SymptomsWhen building an InstallShield 2015 and later project that is signed with a SHA-1 certificate the following erro...
by Flexera hereComesThePizza Flexera