cancel
Showing results for 
Search instead for 
Did you mean: 
nk_sundaram
Pilgrim

Installshield Limited Edition for Visual Studio 2012 - 6103 error

I am getting 3 errors for AppManifest.xaml file. For the same project in VS2010 it does creates the setup without any error. But in VS2012 it gives file not found error. Please help.

-6103: Could not find file "Bin\Release\AppManifest.xaml" ISEXP : error : -6103: Could not find file "Bin\Release\AppManifest.xaml"

-6271: File Bin\Release\AppManifest.xaml not found. An error occurred building the MsiFileHash table record for this file. Verify that the file exists in the specified location. ISEXP : error : -6271: File Bin\Release\AppManifest.xaml not found. An error occurred building the MsiFileHash table record for this file. Verify that the file exists in the specified location.

-1007: Cannot copy source 'Bin\Release\AppManifest.xaml' to target 'D:\Freelancing\Installable Windows Service application\Komo2\ISLSetup\ISLSetup\Express\SingleImage\DiskImages\DISK1\IISRootFolder\AppManifest.xaml' ISEXP : error : -1007: Cannot copy source 'Bin\Release\AppManifest.xaml' to target 'D:\Freelancing\Installable Windows Service application\Komo2\ISLSetup\ISLSetup\Express\SingleImage\DiskImages\DISK1\IISRootFolder\AppManifest.xaml'







This is the output
1>------ Build started: Project: promodo Web.Web, Configuration: Release Any CPU ------
2>------ Build started: Project: promoService, Configuration: Release Any CPU ------
1> promodo Web.Web -> D:\Freelancing\Installable Windows Service application\promo2\promodo Web.Web\bin\promodo Web.Web.dll
3>------ Build started: Project: promodo Web, Configuration: Release Any CPU ------
2>D:\Freelancing\Installable Windows Service application\promo2\promoService\Service1.cs(24,28,24,37): warning CS0169: The field 'promoService.LicenseMonitor.TInterval' is never used
2> promoService -> D:\Freelancing\Installable Windows Service application\promo2\promoService\bin\Release\promoService.exe
3> promodo Web -> D:\Freelancing\Installable Windows Service application\promo2\promodo Web\Bin\Release\promodo Web.dll
3> Begin application manifest generation
3> Application manifest generation completed successfully
3> Begin Xap packaging
3> Creating file promodo_Web.xap
3> Adding promodo Web.dll
3> Adding System.ComponentModel.DataAnnotations.dll
3> Adding System.ServiceModel.DomainServices.Client.dll
3> Adding System.ServiceModel.DomainServices.Client.Web.dll
3> Adding System.ServiceModel.Web.Extensions.dll
3> Adding System.Windows.Controls.Data.DataForm.Toolkit.dll
3> Adding System.Windows.Controls.Data.Input.dll
3> Adding System.Windows.Controls.dll
3> Adding System.Windows.Controls.Navigation.dll
3> Adding System.Windows.Data.dll
3> Adding Properties\AppManifest.xml
3> Adding AppManifest.xaml
3> Xap packaging completed successfully
3> Creating test page
3> Test page created successfully
4>------ Build started: Project: ISLSetup, Configuration: SingleImage ------
4>Created release folders
4>AdminExecuteSequence table successfully built
4>AdminUISequence table successfully built
4>AdvtExecuteSequence table successfully built
4>AdvtUISequence table successfully built
4>InstallExecuteSequence table successfully built
4>InstallUISequence table successfully built
4>Directory table successfully built
4>Feature table successfully built
4>FeatureComponents table successfully built
4>Component table successfully built
4>Loading File table
4>ISEXP : error : -6103: Could not find file "Bin\Release\AppManifest.xaml"
4>Building File table
4>ISEXP : warning : -6245: One or more of the project's components contain .NET properties that require the .NET Framework. It is recommended that the release include the .NET Framework.
4>Adding file 'System.ServiceModel.DomainServices.Client.dll' that is a dependency of component 'promodo_Web.Primary_output2'
4>Adding file 'System.ServiceModel.DomainServices.Client.Web.dll' that is a dependency of component 'promodo_Web.Primary_output2'
4>Adding file 'System.ServiceModel.Web.Extensions.dll' that is a dependency of component 'promodo_Web.Primary_output2'
4>Adding file 'System.Windows.Browser.dll' that is a dependency of component 'promodo_Web.Primary_output2'
4>Adding file 'System.Windows.Controls.Data.DataForm.Toolkit.dll' that is a dependency of component 'promodo_Web.Primary_output2'
4>Adding file 'System.Windows.Controls.Data.Input.dll' that is a dependency of component 'promodo_Web.Primary_output2'
4>Adding file 'System.Windows.Controls.dll' that is a dependency of component 'promodo_Web.Primary_output2'
4>Adding file 'System.Windows.Controls.Navigation.dll' that is a dependency of component 'promodo_Web.Primary_output2'
4>ISEXP : warning : -6248: Could not find dependent file agcore.dll, or one of its dependencies of component promodo_Web.Primary_output2
4>ISEXP : warning : -6248: Could not find dependent file System.Windows.Data, or one of its dependencies of component promodo_Web.Primary_output2
4>Adding file 'System.ServiceModel.DomainServices.Hosting.dll' that is a dependency of component 'promodo_Web.Web.Primary_output2'
4>Adding file 'System.ServiceModel.DomainServices.Server.dll' that is a dependency of component 'promodo_Web.Web.Primary_output2'
4>Adding file 'System.Web.Providers.dll' that is a dependency of component 'promodo_Web.Web.Primary_output2'
4>File table successfully built
4>Building MsiFileHash table
4>ISEXP : error : -6271: File Bin\Release\AppManifest.xaml not found. An error occurred building the MsiFileHash table record for this file. Verify that the file exists in the specified location.
4>MsiFileHash table successfully built
4>Class table successfully built
4>Extension table successfully built
4>ActionText table successfully built
4>AppSearch table successfully built
4>CCPSearch table successfully built
4>Condition table successfully built
4>AppId table successfully built
4>Started signing C066.tmp ...
4>Property table successfully built
4>Binary table successfully built
4>CompLocator table successfully built
4>ControlCondition table successfully built
4>ControlEvent table successfully built
4>CreateFolder table successfully built
4>CustomAction table successfully built
4>Error table successfully built
4>DrLocator table successfully built
4>DuplicateFile table successfully built
4>Environment table successfully built
4>EventMapping table successfully built
4>Font table successfully built
4>ProgId table successfully built
4>ISIISItem table successfully built
4>ISIISProperty table successfully built
4>ISSelfReg table successfully built
4>IniFile table successfully built
4>IniLocator table successfully built
4>LaunchCondition table successfully built
4>MIME table successfully built
4>MoveFile table successfully built
4>MsiAssembly table successfully built
4>MsiAssemblyName table successfully built
4>MsiDigitalCertificate table successfully built
4>MsiDigitalSignature table successfully built
4>MsiPackageCertificate table successfully built
4>MsiPatchCertificate table successfully built
4>MsiShortcutProperty table successfully built
4>PatchPackage table successfully built
4>PublishComponent table successfully built
4>RegLocator table successfully built
4>Registry table successfully built
4>RemoveFile table successfully built
4>RemoveIniFile table successfully built
4>RemoveRegistry table successfully built
4>ReserveCost table successfully built
4>SelfReg table successfully built
4>ServiceControl table successfully built
4>ServiceInstall table successfully built
4>Shortcut table successfully built
4>Signature table successfully built
4>TextStyle table successfully built
4>TypeLib table successfully built
4>UIText table successfully built
4>Upgrade table successfully built
4>Verb table successfully built
4>_Validation table successfully built
4>Searching project for extract-at-build components...
4>Building scanned MsiAssembly records
4>Building scanned MsiAssemblyName records
4>Validating Custom Action sequencing
4>Embedding manifest SetupExe.Invoker.manifest into setup.exe

Error 1 -6103: Could not find file "Bin\Release\AppManifest.xaml" ISEXP : error : -6103: Could not find file "Bin\Release\AppManifest.xaml"

Warning 2 -6245: One or more of the project's components contain .NET properties that require the .NET Framework. It is recommended that the release include the .NET Framework. ISEXP : warning : -6245: One or more of the project's components contain .NET properties that require the .NET Framework. It is recommended that the release include the .NET Framework.

Warning 3 -6248: Could not find dependent file agcore.dll, or one of its dependencies of component promodo_Web.Primary_output2 ISEXP : warning : -6248: Could not find dependent file agcore.dll, or one of its dependencies of component promodo_Web.Primary_output2

Warning 4 -6248: Could not find dependent file System.Windows.Data, or one of its dependencies of component promodo_Web.Primary_output2 ISEXP : warning : -6248: Could not find dependent file System.Windows.Data, or one of its dependencies of component promodo_Web.Primary_output2

Error 5 -6271: File Bin\Release\AppManifest.xaml not found. An error occurred building the MsiFileHash table record for this file. Verify that the file exists in the specified location. ISEXP : error : -6271: File Bin\Release\AppManifest.xaml not found. An error occurred building the MsiFileHash table record for this file. Verify that the file exists in the specified location.

Error 6 -1007: Cannot copy source 'Bin\Release\AppManifest.xaml' to target 'D:\Freelancing\Installable Windows Service application\promo2\ISLSetup\ISLSetup\Express\SingleImage\DiskImages\DISK1\IISRootFolder\AppManifest.xaml' ISEXP : error : -1007: Cannot copy source 'Bin\Release\AppManifest.xaml' to target 'D:\Freelancing\Installable Windows Service application\promo2\ISLSetup\ISLSetup\Express\SingleImage\DiskImages\DISK1\IISRootFolder\AppManifest.xaml'
0 Kudos
1 Reply
Chaitra
Pilgrim

Re: Installshield Limited Edition for Visual Studio 2012 - 6103 error

Hi,

Kindly follow the below links to find more information about error 6103:

http://flexerasoftware.force.com/articles/en_US/ERRDOC/Q109061

http://community.flexerasoftware.com/showthread.php?57675-Error-6103

Also, kindly check the project dependencies of your project.

Hope this helps.

Please let us know if you need any further information on this.

Thanks,
Chaitra
0 Kudos